Install salome_cfd_extensions with Salome 9.11

Dear All,
I have installed Salome 9.11 on my Ubuntu 22.04 and it works very well. I have also installed Code Saturne 8.0.2 and it is also working very well… Great ! Now, I would like to add salome_cfd_extensions to have access to Code Saturne directly from Salome but it is not working (argh!!). I followed this tutorial :

Everything is fine until the moment when we have to launch make and make-install. When i type make i have the following error which appears:

Configuration options:
use debugging code: no
SALOME KERNEL support: yes
SALOME GUI support: yes

The package has been configured. Type:
make install

To generate and install the salome CFD extensions

[NS=no_host:no_port]$ make
make all-recursive
make[1] : on entre dans le répertoire « /home/pierre/salome/salome_cfd_extensions »
Making all in cfd_study
make[2] : on entre dans le répertoire « /home/pierre/salome/salome_cfd_extensions/cfd_study »
Making all in idl
make[3] : on entre dans le répertoire « /home/pierre/salome/salome_cfd_extensions/cfd_study/idl »
. /home/pierre/Documents/SALOME-9.11.0-native-UB22.04-SRC/;
/usr/bin/python /home/pierre/Documents/SALOME-9.11.0-native-UB22.04-SRC/BINARIES-UB22.04/omniORB/bin/omniidl -bcxx -Wba -nf -I/home/pierre/Documents/SALOME-9.11.0-native-UB22.04-SRC/BINARIES-UB22.04/omniORB/idl -I/home/pierre/Documents/SALOME-9.11.0-native-UB22.04-SRC/INSTALL/KERNEL/idl/salome -I/home/pierre/Documents/SALOME-9.11.0-native-UB22.04-SRC/INSTALL/GUI/idl/salome CFDSTUDY_Gen.idl
CFDSTUDY_Gen.idl:26: SALOME_Component.idl: No such file or directory
CFDSTUDY_Gen.idl:27: SALOMEDS.idl: No such file or directory
CFDSTUDY_Gen.idl:32: Error in look-up of ‘Engines::EngineComponent’: ‘Engines’ not found
CFDSTUDY_Gen.idl:33: Error in look-up of ‘SALOMEDS::Driver’: ‘SALOMEDS’ not found
omniidl: 2 errors.
omniidl: Error running preprocessor
make[3]: *** [Makefile:901 :] Erreur 1
make[3] : on quitte le répertoire « /home/pierre/salome/salome_cfd_extensions/cfd_study/idl »
make[2]: *** [Makefile:427 : all-recursive] Erreur 1
make[2] : on quitte le répertoire « /home/pierre/salome/salome_cfd_extensions/cfd_study »
make[1]: *** [Makefile:612 : all-recursive] Erreur 1
make[1] : on quitte le répertoire « /home/pierre/salome/salome_cfd_extensions »
make: *** [Makefile:509 : all] Erreur 2

Any idea how can I fix this issue ? Thank you for your help !

I did not give it a try, but at first sight, from the log, one can read that KERNEL is not found.
The compiler is looking for INSTALL whereas you’re using BINARIES-UB22.04

You can try to setup the developer mode, namely:

tar zxf SALOME-9.11.0-native-UB22.04-SRC.tar.gz
cd SALOME-9.11.0-native-UB22.04-SRC
chmod u+x ./
./sat/sat environ SALOME-9.11.0-native
./sat/sat launcher SALOME-9.11.0-native
sat/sat launcher SALOME-9.11.0-native --use_mesa --name mesa_salome

and repeat the prescription by Cyprien.

Dear NabilG,
Thank you very much for your reply ! It works !

Best regards,